BDBM50475014 CHEMBL361948
SMILES CC(=O)N1CCn2cc(C3=C(C(=O)NC3=O)c3cnc4ccccn34)c3cccc(C1)c23
InChI Key InChIKey=IOSOHDPFAYTRIG-UHFFFAOYSA-N
Data  2 IC50
  Tab Delimited (TSV)   2D SDfile   Computed 3D by Vconf -m prep SDfile
Find this compound or compounds like it in BindingDB:
Activity Spreadsheet -- Enzyme Inhibition Constant Data from BindingDB
Found 2 hits for monomerid = 50475014
TargetGlycogen synthase kinase-3 beta(Homo sapiens (Human))
Lilly Research Laboratories
Curated by ChEMBL
LigandPNGBDBM50475014(CHEMBL361948)
Affinity DataIC50:  111nM. Assay description: Inhibitory concentration to inhibit Ser396 phosphorylation of tau, a natural substrate of GSK-3 in SY5Y cells
Ligand InfoPC cidPC sid
In DepthDetails ArticlePubMed
TargetGlycogen synthase kinase-3(Homo sapiens (Human))
Lilly Research Laboratories
Curated by ChEMBL
LigandPNGBDBM50475014(CHEMBL361948)
Affinity DataIC50:  1.90nM. Assay description: Inhibitory concentration against the Glycogen synthase kinase-3
Ligand InfoPC cidPC sid
In DepthDetails ArticlePubMed