BDBM50475020 CHEMBL181464
SMILES CN(C)C(=O)N1CCn2cc(C3=C(C(=O)NC3=O)c3ccn4ncccc34)c3cccc(C1)c23
InChI Key InChIKey=ODMDEVGMHNNVJK-UHFFFAOYSA-N
Data  2 IC50
  Tab Delimited (TSV)   2D SDfile   Computed 3D by Vconf -m prep SDfile
Find this compound or compounds like it in BindingDB:
Activity Spreadsheet -- Enzyme Inhibition Constant Data from BindingDB
Found 2 hits for monomerid = 50475020
TargetGlycogen synthase kinase-3 beta(Homo sapiens (Human))
Lilly Research Laboratories
Curated by ChEMBL
LigandPNGBDBM50475020(CHEMBL181464)
Affinity DataIC50:  38nM. Assay description: Inhibitory concentration to inhibit Ser396 phosphorylation of tau, a natural substrate of GSK-3 in SY5Y cells
Ligand InfoPC cidPC sid
In DepthDetails ArticlePubMed
TargetGlycogen synthase kinase-3(Homo sapiens (Human))
Lilly Research Laboratories
Curated by ChEMBL
LigandPNGBDBM50475020(CHEMBL181464)
Affinity DataIC50:  4.70nM. Assay description: Inhibitory concentration against the Glycogen synthase kinase-3
Ligand InfoPC cidPC sid
In DepthDetails ArticlePubMed