BDBM50475087 CHEMBL363713
SMILES [O-][N+](=O)c1ccc(o1)C(=O)Nc1cccc(Br)c1
InChI Key InChIKey=SDJZUFQFORLTGO-UHFFFAOYSA-N
Data  1 IC50
  Tab Delimited (TSV)   2D SDfile   Computed 3D by Vconf -m prep SDfile
Find this compound or compounds like it in BindingDB:
Activity Spreadsheet -- Enzyme Inhibition Constant Data from BindingDB
Found 1 hit for monomerid = 50475087
TargetUDP-galactopyranose mutase(Mycobacterium tuberculosis H37Rv)
University Of Tennessee Health Science Center
Curated by ChEMBL
LigandPNGBDBM50475087(CHEMBL363713)
Affinity DataIC50:  3.53E+4nM. Assay description: Inhibition of Mycobacterium tuberculosis UDP-galactose mutase expressed in Escherichia coli UDP-6 [3H]- Galf
In DepthDetails ArticlePubMed