BDBM50475089 CHEMBL364555
SMILES C[C@@H](NC(=O)c1ccc(o1)[N+]([O-])=O)c1ccccc1
InChI Key InChIKey=YVLORCVRBMUNQM-SECBINFHSA-N
Data  1 IC50
  Tab Delimited (TSV)   2D SDfile   Computed 3D by Vconf -m prep SDfile
Find this compound or compounds like it in BindingDB:
Activity Spreadsheet -- Enzyme Inhibition Constant Data from BindingDB
Found 1 hit for monomerid = 50475089
TargetUDP-galactopyranose mutase(Mycobacterium tuberculosis H37Rv)
University Of Tennessee Health Science Center
Curated by ChEMBL
LigandPNGBDBM50475089(CHEMBL364555)
Affinity DataIC50:  1.49E+5nM. Assay description: Inhibition of Mycobacterium tuberculosis UDP-galactose mutase expressed in Escherichia coli UDP-6 [3H]- Galf
In DepthDetails ArticlePubMed