BDBM50475095 CHEMBL364195
SMILES [O-][N+](=O)c1ccc(o1)C(=O)Nc1ccncc1
InChI Key InChIKey=NPHVAXHCDBAVFL-UHFFFAOYSA-N
Data  1 IC50
  Tab Delimited (TSV)   2D SDfile   Computed 3D by Vconf -m prep SDfile
Find this compound or compounds like it in BindingDB:
Activity Spreadsheet -- Enzyme Inhibition Constant Data from BindingDB
Found 1 hit for monomerid = 50475095
TargetUDP-galactopyranose mutase(Mycobacterium tuberculosis H37Rv)
University Of Tennessee Health Science Center
Curated by ChEMBL
LigandPNGBDBM50475095(CHEMBL364195)
Affinity DataIC50:  1.84E+5nM. Assay description: Inhibition of Mycobacterium tuberculosis UDP-galactose mutase expressed in Escherichia coli UDP-6 [3H]- Galf
Ligand InfoPC cidPC sid
In DepthDetails ArticlePubMed