BDBM50475363 CHEMBL194774
SMILES CCc1nc2cc(O)ccc2c(Oc2ccc(\C=C\C(=O)N(C)C)cc2)c1-c1ccccc1
InChI Key InChIKey=YABZUMJRVRJHHV-SFQUDFHCSA-N
Data  2 KI  1 IC50
  Tab Delimited (TSV)   2D SDfile   Computed 3D by Vconf -m prep SDfile
Find this compound or compounds like it in BindingDB:
Activity Spreadsheet -- Enzyme Inhibition Constant Data from BindingDB
Found 3 hits for monomerid = 50475363
TargetEstrogen receptor(Homo sapiens (Human))
Glaxosmithkline Research & Development
Curated by ChEMBL
LigandPNGBDBM50475363(CHEMBL194774)
Affinity DataKi:  10nM. Assay description: Binding affinity for human estrogen receptor alpha
Ligand InfoPC cidPC sid
In DepthDetails ArticlePubMed
TargetEstrogen receptor beta(Homo sapiens (Human))
Glaxosmithkline Research & Development
Curated by ChEMBL
LigandPNGBDBM50475363(CHEMBL194774)
Affinity DataKi:  20nM. Assay description: Binding affinity for human estrogen receptor beta
Ligand InfoPC cidPC sid
In DepthDetails ArticlePubMed
TargetEstrogen receptor beta(Homo sapiens (Human))
Glaxosmithkline Research & Development
Curated by ChEMBL
LigandPNGBDBM50475363(CHEMBL194774)
Affinity DataIC50:  4nM. Assay description: pIC50 for 1 nM estradiol-induced Ishikawa cell proliferation
Ligand InfoPC cidPC sid
In DepthDetails ArticlePubMed