BDBM50477309 CHEMBL235328
SMILES CC(=O)NCCN(c1ccccc1)c1cccc(Br)c1
InChI Key InChIKey=OKYAPNKEZRTVMT-UHFFFAOYSA-N
Data  2 KI
  Tab Delimited (TSV)   2D SDfile   Computed 3D by Vconf -m prep SDfile
Find this compound or compounds like it in BindingDB:
Activity Spreadsheet -- Enzyme Inhibition Constant Data from BindingDB
Found 2 hits for monomerid = 50477309
TargetMelatonin receptor type 1B(Homo sapiens (Human))
Universit£
Curated by ChEMBL
LigandPNGBDBM50477309(CHEMBL235328)
Affinity DataKi:  0.200nM. Assay description: Displacement of 2-[125I]iodomelatonin from human cloned MT2 receptor expressed in rat NIH3T3 cells
Ligand InfoPC cidPC sid
In DepthDetails ArticlePubMed
TargetMelatonin receptor type 1A(Homo sapiens (Human))
Universit£
Curated by ChEMBL
LigandPNGBDBM50477309(CHEMBL235328)
Affinity DataKi:  17nM. Assay description: Displacement of 2-[125I]iodomelatonin from human cloned MT1 receptor expressed in rat NIH3T3 cells
Ligand InfoPC cidPC sid
In DepthDetails ArticlePubMed