BDBM50477315 CHEMBL237234
SMILES COc1cccc(c1)N(CCNC(C)=O)c1ccc2ccccc2c1
InChI Key InChIKey=PYUSLQCLSFTYGV-UHFFFAOYSA-N
Data  2 KI
  Tab Delimited (TSV)   2D SDfile   Computed 3D by Vconf -m prep SDfile
Find this compound or compounds like it in BindingDB:
Activity Spreadsheet -- Enzyme Inhibition Constant Data from BindingDB
Found 2 hits for monomerid = 50477315
TargetMelatonin receptor type 1B(Homo sapiens (Human))
Universit£
Curated by ChEMBL
LigandPNGBDBM50477315(CHEMBL237234)
Affinity DataKi:  0.112nM. Assay description: Displacement of 2-[125I]iodomelatonin from human cloned MT2 receptor expressed in rat NIH3T3 cells
Ligand InfoPC cidPC sid
In DepthDetails ArticlePubMed
TargetMelatonin receptor type 1A(Homo sapiens (Human))
Universit£
Curated by ChEMBL
LigandPNGBDBM50477315(CHEMBL237234)
Affinity DataKi:  132nM. Assay description: Displacement of 2-[125I]iodomelatonin from human cloned MT1 receptor expressed in rat NIH3T3 cells
Ligand InfoPC cidPC sid
In DepthDetails ArticlePubMed