BDBM50477985 CHEMBL412149
SMILES COc1cc(\C=C2\C(C)=NN(C2=O)c2nnn[nH]2)cc(Cl)c1OC
InChI Key InChIKey=KGXXWSYHMXIUDE-WTKPLQERSA-N
Data  2 IC50
  Tab Delimited (TSV)   2D SDfile   Computed 3D by Vconf -m prep SDfile
Find this compound or compounds like it in BindingDB:
Activity Spreadsheet -- Enzyme Inhibition Constant Data from BindingDB
Found 2 hits for monomerid = 50477985
TargetIntegrase(Human immunodeficiency virus 1)
University Of Southern California
Curated by ChEMBL
LigandPNGBDBM50477985(CHEMBL412149)
Affinity DataIC50:  4nM. Assay description: Inhibition of HIV1 integrase strand transfer activity
Ligand InfoPC cidPC sid
In DepthDetails ArticlePubMed
TargetIntegrase(Human immunodeficiency virus 1)
University Of Southern California
Curated by ChEMBL
LigandPNGBDBM50477985(CHEMBL412149)
Affinity DataIC50:  5nM. Assay description: Inhibition of HIV1 integrase 3'-end processing activity
Ligand InfoPC cidPC sid
In DepthDetails ArticlePubMed