BDBM50481094 CHEMBL567931
SMILES CN(Cc1oc2ccccc2c1C)C(=O)\C=C\c1cnc2NC(=O)CCNc2c1
InChI Key InChIKey=AETHKMIMGKCKGE-BQYQJAHWSA-N
Data  1 IC50
  Tab Delimited (TSV)   2D SDfile   Computed 3D by Vconf -m prep SDfile
Find this compound or compounds like it in BindingDB:
Activity Spreadsheet -- Enzyme Inhibition Constant Data from BindingDB
Found 1 hit for monomerid = 50481094
TargetEnoyl-[acyl-carrier-protein] reductase [NADH] FabI(Escherichia coli)
Affinium Pharmaceuticals
Curated by ChEMBL
LigandPNGBDBM50481094(CHEMBL567931)
Affinity DataIC50:  25nM. Assay description: Inhibition of Escherichia coli FabI
Ligand InfoPC cidPC sid
In DepthDetails ArticlePubMed