BDBM50481098 CHEMBL567311
SMILES CN(Cc1oc2ccccc2c1C)C(=O)\C=C\c1cnc2NCCC(=O)NCc2c1
InChI Key InChIKey=ORLQRNJZLPRIRD-BQYQJAHWSA-N
Data  1 IC50
  Tab Delimited (TSV)   2D SDfile   Computed 3D by Vconf -m prep SDfile
Find this compound or compounds like it in BindingDB:
Activity Spreadsheet -- Enzyme Inhibition Constant Data from BindingDB
Found 1 hit for monomerid = 50481098
TargetEnoyl-[acyl-carrier-protein] reductase [NADH] FabI(Escherichia coli)
Affinium Pharmaceuticals
Curated by ChEMBL
LigandPNGBDBM50481098(CHEMBL567311)
Affinity DataIC50:  30nM. Assay description: Inhibition of Escherichia coli FabI
Ligand InfoPC cidPC sid
In DepthDetails ArticlePubMed