BDBM50481112 CHEMBL567711
SMILES CN(Cc1oc2ccccc2c1C)C(=O)\C=C\c1cnc2NC(=O)C3(CCN(C)CC3)Cc2c1
InChI Key InChIKey=ZIXSCOJWKIXXJL-CMDGGOBGSA-N
Data  2 IC50
  Tab Delimited (TSV)   2D SDfile   Computed 3D by Vconf -m prep SDfile
Find this compound or compounds like it in BindingDB:
Activity Spreadsheet -- Enzyme Inhibition Constant Data from BindingDB
Found 2 hits for monomerid = 50481112
TargetEnoyl-[acyl-carrier-protein] reductase [NADPH] FabI(Staphylococcus aureus)
Affinium Pharmaceuticals
Curated by ChEMBL
LigandPNGBDBM50481112(CHEMBL567711)
Affinity DataIC50:  20nM. Assay description: Inhibition of Staphylococcus aureus FabI
Ligand InfoPC cidPC sid
In DepthDetails ArticlePubMed
TargetEnoyl-[acyl-carrier-protein] reductase [NADH] FabI(Escherichia coli)
Affinium Pharmaceuticals
Curated by ChEMBL
LigandPNGBDBM50481112(CHEMBL567711)
Affinity DataIC50:  1.80nM. Assay description: Inhibition of Escherichia coli FabI assessed as effect on NAD(P)H consumption
Ligand InfoPC cidPC sid
In DepthDetails ArticlePubMed