BDBM50481298 CHEMBL247483
SMILES CC(C)CCCC(C)CCCC(C)CCCC1(C)CCc2c(CO[N+]([O-])=O)c(OC(C)=O)c(C)c(C)c2O1
InChI Key InChIKey=LOVYDEBGBMWEEF-UHFFFAOYSA-N
Data  1 Kd
  Tab Delimited (TSV)   2D SDfile   Computed 3D by Vconf -m prep SDfile
Find this compound or compounds like it in BindingDB:
Activity Spreadsheet -- Enzyme Inhibition Constant Data from BindingDB
Found 1 hit for monomerid = 50481298
TargetAlpha-tocopherol transfer protein(Homo sapiens)
Universidad De La Rep£Blica
Curated by ChEMBL
LigandPNGBDBM50481298(CHEMBL247483)
Affinity DataKd:  360nM. Assay description: Displacement of NBD-Toc from human recombinant alphaTTP
Ligand InfoPC cidPC sid
In DepthDetails ArticlePubMed