BDBM50481302 CHEMBL594042
SMILES Cc1c(C)c2OC(C)(CCc2c(C)c1O)C(=O)OCCOc1no[n+]([O-])c1S(=O)(=O)c1ccccc1
InChI Key InChIKey=GJBLZJHUOGPROH-UHFFFAOYSA-N
Data  1 Kd
  Tab Delimited (TSV)   2D SDfile   Computed 3D by Vconf -m prep SDfile
Find this compound or compounds like it in BindingDB:
Activity Spreadsheet -- Enzyme Inhibition Constant Data from BindingDB
Found 1 hit for monomerid = 50481302
TargetAlpha-tocopherol transfer protein(Homo sapiens)
Universidad De La Rep£Blica
Curated by ChEMBL
LigandPNGBDBM50481302(CHEMBL594042)
Affinity DataKd:  2.39E+3nM. Assay description: Displacement of NBD-Toc from human recombinant alphaTTP
Ligand InfoPC cidPC sid
In DepthDetails ArticlePubMed