BDBM50483170 CHEMBL1632168
SMILES CC(C)(C)C(=O)OCOC(=O)c1ccc(CN2CCC(CNC(=O)c3c4OCCCn4c4ccccc34)CC2)cc1
InChI Key InChIKey=DFKNWIKOHATLBP-UHFFFAOYSA-N
Data  1 KI
  Tab Delimited (TSV)   2D SDfile   Computed 3D by Vconf -m prep SDfile
Find this compound or compounds like it in BindingDB:
Activity Spreadsheet -- Enzyme Inhibition Constant Data from BindingDB
Found 1 hit for monomerid = 50483170
Target5-hydroxytryptamine receptor 4(Homo sapiens (Human))
Drug Discovery Laboratory
Curated by ChEMBL
LigandPNGBDBM50483170(CHEMBL1632168)
Affinity DataKi:  0.339nM. Assay description: Displacement of [3H]GR113808 from human 5HT4 receptor expressed in HEK293 cells by liquid scintillation counting
Ligand InfoPC cidPC sid
In DepthDetails ArticlePubMed