BDBM50483182 CHEMBL1632161
SMILES CC(C)(C)OC(=O)CN1CCC(CNC(=O)c2c3OCCCn3c3ccccc23)CC1
InChI Key InChIKey=FKPXNPDXTUQVRM-UHFFFAOYSA-N
Data  1 KI
  Tab Delimited (TSV)   2D SDfile   Computed 3D by Vconf -m prep SDfile
Find this compound or compounds like it in BindingDB:
Activity Spreadsheet -- Enzyme Inhibition Constant Data from BindingDB
Found 1 hit for monomerid = 50483182
Target5-hydroxytryptamine receptor 4(Homo sapiens (Human))
Drug Discovery Laboratory
Curated by ChEMBL
LigandPNGBDBM50483182(CHEMBL1632161)
Affinity DataKi:  0.759nM. Assay description: Displacement of [3H]GR113808 from human 5HT4 receptor expressed in HEK293 cells by liquid scintillation counting
Ligand InfoPC cidPC sid
In DepthDetails ArticlePubMed