BDBM50484194 CHEMBL1819289
SMILES [H][C@@]12C[C@@H](C[C@]1([H])C(=O)CO2)OC(=O)N[C@@H](Cc1ccccc1)[C@H](O)CN(CC(C)C)S(=O)(=O)c1ccc(OC)cc1
InChI Key InChIKey=IHIYGFKADOCHGS-HOZVGSINSA-N
Data  1 KI
  Tab Delimited (TSV)   2D SDfile   Computed 3D by Vconf -m prep SDfile
Find this compound or compounds like it in BindingDB:
Activity Spreadsheet -- Enzyme Inhibition Constant Data from BindingDB
Found 1 hit for monomerid = 50484194
TargetProtease(Human immunodeficiency virus 1 (HIV-1))
Purdue University
Curated by ChEMBL
LigandPNGBDBM50484194(CHEMBL1819289)
Affinity DataKi:  0.950nM. Assay description: Inhibition of Human immunodeficiency virus 1 protease assessed as release of fluorescent N-terminal tripeptide using fluorogenic substrate by continu...
Ligand InfoPC cidPC sid
In DepthDetails ArticlePubMed