BDBM50484843 CHEMBL1958484
SMILES [H][C@@]12C[C@@H](C[C@]1([H])[C@@H](CO2)NS(C)(=O)=O)OC(=O)N[C@@H](Cc1ccccc1)[C@H](O)CN(CC(C)C)S(=O)(=O)c1ccc(OC)cc1
InChI Key InChIKey=LHTBNLUGAFORLV-YZGPKJBYSA-N
Data  1 KI
  Tab Delimited (TSV)   2D SDfile   Computed 3D by Vconf -m prep SDfile
Find this compound or compounds like it in BindingDB:
Activity Spreadsheet -- Enzyme Inhibition Constant Data from BindingDB
Found 1 hit for monomerid = 50484843
TargetProtease(Human immunodeficiency virus 1 (HIV-1))
Purdue University
Curated by ChEMBL
LigandPNGBDBM50484843(CHEMBL1958484)
Affinity DataKi:  0.0320nM. Assay description: Inhibition of HIV1 protease using hexapeptide Ac-Thr-Ile-Nle-Nle-Gln-Arg-NH2 as substrate by fluorimetric assay
Ligand InfoPC cidPC sid
In DepthDetails ArticlePubMed