BDBM50485331 CHEMBL2046603
SMILES Clc1cccc(NC(=O)C(\OC2CCCC2)=C(/C=N)N2CCN(CC2)S(=O)(=O)NCc2ccccc2)c1
InChI Key InChIKey=POQURDKYGIGRLF-ZWTHDRSTSA-N
Data  1 IC50
  Tab Delimited (TSV)   2D SDfile   Computed 3D by Vconf -m prep SDfile
Find this compound or compounds like it in BindingDB:
Activity Spreadsheet -- Enzyme Inhibition Constant Data from BindingDB
Found 1 hit for monomerid = 50485331
Target1,3-beta-D-glucan synthase catalytic subunit(Candida albicans)
Albany Molecular Research, Inc. (Amri)
Curated by ChEMBL
LigandPNGBDBM50485331(CHEMBL2046603)
Affinity DataIC50:  87.9nM. Assay description: Inhibition of glucan synthase in Candida albicans BWP17 membrane
Ligand InfoPC cidPC sid
In DepthDetails ArticlePubMed