BDBM50485364 CHEMBL2059474
SMILES FCC1(COc2c(cnn(-c3cccc(Cl)c3)c2=O)N2CCN(CC2)S(=O)(=O)Cc2ccccc2)CC1
InChI Key InChIKey=GYPJLFYAENCNCK-UHFFFAOYSA-N
Data  1 IC50
  Tab Delimited (TSV)   2D SDfile   Computed 3D by Vconf -m prep SDfile
Find this compound or compounds like it in BindingDB:
Activity Spreadsheet -- Enzyme Inhibition Constant Data from BindingDB
Found 1 hit for monomerid = 50485364
Target1,3-beta-D-glucan synthase catalytic subunit(Candida albicans)
Merck Research Laboratories
Curated by ChEMBL
LigandPNGBDBM50485364(CHEMBL2059474)
Affinity DataIC50:  54.8nM. Assay description: Inhibition of 1,3-beta-D-glucan synthase in Candida albicans BWP17 membranes
Ligand InfoPC cidPC sid
In DepthDetails ArticlePubMed