BDBM50485372 CHEMBL2059488
SMILES Nc1ccc(CS(=O)(=O)N2CCN(CC2)c2cnn(-c3cc(F)cc(F)c3)c(=O)c2OC2CCCC2)cc1
InChI Key InChIKey=UYBBZRCUQGOFCG-UHFFFAOYSA-N
Data  1 IC50
  Tab Delimited (TSV)   2D SDfile   Computed 3D by Vconf -m prep SDfile
Find this compound or compounds like it in BindingDB:
Activity Spreadsheet -- Enzyme Inhibition Constant Data from BindingDB
Found 1 hit for monomerid = 50485372
Target1,3-beta-D-glucan synthase catalytic subunit(Candida albicans)
Merck Research Laboratories
Curated by ChEMBL
LigandPNGBDBM50485372(CHEMBL2059488)
Affinity DataIC50:  109nM. Assay description: Inhibition of 1,3-beta-D-glucan synthase in Candida albicans BWP17 membranes
Ligand InfoPC cidPC sid
In DepthDetails ArticlePubMed