BDBM50485490 CHEMBL2063087
SMILES [H][C@@]12C[C@H](N(C1)C(=O)[C@@H](NC(=O)OCC(C)(C)CCCCCc1nc3ccc(OC)cc3cc1O2)C1CCCCC1)C(=O)N[C@@]1(C[C@H]1C=C)C(=O)NS(=O)(=O)C1CC1
InChI Key InChIKey=LKEIANAQOBMEEA-VYKJYLEMSA-N
Data  2 KI
  Tab Delimited (TSV)   2D SDfile   Computed 3D by Vconf -m prep SDfile
Find this compound or compounds like it in BindingDB:
Activity Spreadsheet -- Enzyme Inhibition Constant Data from BindingDB
Found 2 hits for monomerid = 50485490
TargetGenome polyprotein(Hepacivirus C)
Merck Research Laboratories
Curated by ChEMBL
LigandPNGBDBM50485490(CHEMBL2063087)
Affinity DataKi:  12nM. Assay description: Inhibition of Hepatitis C virus (isolate BK) genotype 1b NS3/4a protease A156T mutant expressed in Escherichia coli by time-resolved fluorescence ana...
Ligand InfoPC cidPC sid
In DepthDetails ArticlePubMed
TargetGenome polyprotein(Hepacivirus C)
Merck Research Laboratories
Curated by ChEMBL
LigandPNGBDBM50485490(CHEMBL2063087)
Affinity DataKi:  64nM. Assay description: Inhibition of Hepatitis C virus (isolate BK) genotype 1b NS3/4a protease A156V mutant expressed in Escherichia coli by time-resolved fluorescence ana...
Ligand InfoPC cidPC sid
In DepthDetails ArticlePubMed