BDBM50485623 CHEMBL2089287
SMILES C[C@@]12C[C@@](C)([C@@H](CS(=O)(=O)NC(=O)c3ccc(cc3)N3CCN(Cc4ccccc4-c4ccc(Cl)cc4)CC3)CC1)C2(C)C
InChI Key InChIKey=YAIFIQIAZOILGN-QJFUKTLSSA-N
Data  1 IC50
  Tab Delimited (TSV)   2D SDfile   Computed 3D by Vconf -m prep SDfile
Find this compound or compounds like it in BindingDB:
Activity Spreadsheet -- Enzyme Inhibition Constant Data from BindingDB
Found 1 hit for monomerid = 50485623
TargetBcl-2 homologous antagonist/killer(Homo sapiens)
Novartis Institutes For Biomedical Research
Curated by ChEMBL
LigandPNGBDBM50485623(CHEMBL2089287)
Affinity DataIC50: >5.00E+4nM. Assay description: Inhibition of Mcl1-BAK interaction
Ligand InfoPC cidPC sid
In DepthDetails ArticlePubMed