BDBM50485626 CHEMBL2089285
SMILES CC1(C)C2CC[C@]1(CS(=O)(=O)NC(=O)c1ccc(cc1)N1CCN(Cc3ccccc3-c3ccc(Cl)cc3)CC1)C(=O)C2
InChI Key InChIKey=YJLDKNZQDIPLRH-YVFWDZQLSA-N
Data  1 IC50
  Tab Delimited (TSV)   2D SDfile   Computed 3D by Vconf -m prep SDfile
Find this compound or compounds like it in BindingDB:
Activity Spreadsheet -- Enzyme Inhibition Constant Data from BindingDB
Found 1 hit for monomerid = 50485626
TargetBcl-2 homologous antagonist/killer(Homo sapiens)
Novartis Institutes For Biomedical Research
Curated by ChEMBL
LigandPNGBDBM50485626(CHEMBL2089285)
Affinity DataIC50: >5.00E+4nM. Assay description: Inhibition of Mcl1-BAK interaction
Ligand InfoPC cidPC sid
In DepthDetails ArticlePubMed