BDBM50486008 CHEMBL2203684
SMILES NC(=N)c1cccc(NC(=O)c2cccc3-c4ccccc4C(=O)c23)c1
InChI Key InChIKey=UVQCIBYFILQQQH-UHFFFAOYSA-N
Data  1 IC50
  Tab Delimited (TSV)   2D SDfile   Computed 3D by Vconf -m prep SDfile
Find this compound or compounds like it in BindingDB:
Activity Spreadsheet -- Enzyme Inhibition Constant Data from BindingDB
Found 1 hit for monomerid = 50486008
TargetCalmodulin-sensitive adenylate cyclase(Bacillus anthracis)
Utmb
Curated by ChEMBL
LigandPNGBDBM50486008(CHEMBL2203684)
Affinity DataIC50:  2.71E+3nM. Assay description: Inhibition of Bacillus anthracis edema toxin-mediated cAMP production in mouse RAW264.7 cells after 4 hrs by ELISA
Ligand InfoPC cidPC sid
In DepthDetails ArticlePubMed