BDBM50486016 CHEMBL2203669
SMILES Nc1ccc(NC(=O)c2cccc3-c4ccccc4C(=O)c23)cc1C(O)=O
InChI Key InChIKey=KMCLHHLSAJFNEG-UHFFFAOYSA-N
Data  1 IC50
  Tab Delimited (TSV)   2D SDfile   Computed 3D by Vconf -m prep SDfile
Find this compound or compounds like it in BindingDB:
Activity Spreadsheet -- Enzyme Inhibition Constant Data from BindingDB
Found 1 hit for monomerid = 50486016
TargetCalmodulin-sensitive adenylate cyclase(Bacillus anthracis)
Utmb
Curated by ChEMBL
LigandPNGBDBM50486016(CHEMBL2203669)
Affinity DataIC50:  6.08E+3nM. Assay description: Inhibition of Bacillus anthracis edema toxin-mediated cAMP production in mouse RAW264.7 cells after 4 hrs by ELISA
Ligand InfoPC cidPC sid
In DepthDetails ArticlePubMed