BDBM50486108 CHEMBL2203884
SMILES [H][C@]12CCN(C1)C(=O)N[C@@H](C1CCCCC1)C(=O)N1C[C@@]([H])(C[C@H]1C(=O)N[C@@]1(C[C@H]1C=C)C(=O)NS(=O)(=O)C1CC1)Oc1cc(OCC)nc3cc(OC)c(cc13)\C=C\CO2
InChI Key InChIKey=DOPFAJXYFJSQLF-KCUPYEQPSA-N
Data  2 KI
  Tab Delimited (TSV)   2D SDfile   Computed 3D by Vconf -m prep SDfile
Find this compound or compounds like it in BindingDB:
Activity Spreadsheet -- Enzyme Inhibition Constant Data from BindingDB
Found 2 hits for monomerid = 50486108
TargetGenome polyprotein(Hepacivirus C)
Merck Research Laboratories
Curated by ChEMBL
LigandPNGBDBM50486108(CHEMBL2203884)
Affinity DataKi:  0.400nM. Assay description: Inhibition of HCV genotype 1b BK NS3/4A protease A156T mutant expressed in Escherichia coli incubated for 30 mins by time-resolved fluorescence assay
Ligand InfoPC cidPC sid
In DepthDetails ArticlePubMed
TargetGenome polyprotein(Hepacivirus C)
Merck Research Laboratories
Curated by ChEMBL
LigandPNGBDBM50486108(CHEMBL2203884)
Affinity DataKi:  6.80nM. Assay description: Inhibition of HCV genotype 1b BK NS3/4A protease A156V mutant expressed in Escherichia coli incubated for 30 mins by time-resolved fluorescence assay
Ligand InfoPC cidPC sid
In DepthDetails ArticlePubMed