BDBM50486109 CHEMBL2203293
SMILES [H][C@@]12C[C@H](N(C1)C(=O)[C@@H](NC(=O)O[C@]1([H])COC[C@@]1([H])CCC\C=C\c1cc3ccc(OC)cc3nc1O2)C1CCCC1)C(=O)N[C@@]1(C[C@H]1C=C)C(=O)NS(=O)(=O)C1CC1
InChI Key InChIKey=BWVKIFXNVRCJTL-BMOQNZFVSA-N
Data  2 KI
  Tab Delimited (TSV)   2D SDfile   Computed 3D by Vconf -m prep SDfile
Find this compound or compounds like it in BindingDB:
Activity Spreadsheet -- Enzyme Inhibition Constant Data from BindingDB
Found 2 hits for monomerid = 50486109
TargetGenome polyprotein(Hepacivirus C)
Merck Research Laboratories
Curated by ChEMBL
LigandPNGBDBM50486109(CHEMBL2203293)
Affinity DataKi:  7.80nM. Assay description: Inhibition of HCV genotype 1b BK NS3/4A protease A156T mutant expressed in Escherichia coli incubated for 30 mins by time-resolved fluorescence assay
Ligand InfoPC cidPC sid
In DepthDetails ArticlePubMed
TargetGenome polyprotein(Hepacivirus C)
Merck Research Laboratories
Curated by ChEMBL
LigandPNGBDBM50486109(CHEMBL2203293)
Affinity DataKi:  64nM. Assay description: Inhibition of HCV genotype 1b BK NS3/4A protease A156V mutant expressed in Escherichia coli incubated for 30 mins by time-resolved fluorescence assay
Ligand InfoPC cidPC sid
In DepthDetails ArticlePubMed