BDBM50486208 CHEMBL2230219
SMILES COC(=O)Sc1nc2cc(c(F)cc2s1)-n1nc(oc1=O)C(C)(C)C
InChI Key InChIKey=WJMZUQLORLSMDN-UHFFFAOYSA-N
Data  2 KI
  Tab Delimited (TSV)   2D SDfile   Computed 3D by Vconf -m prep SDfile
Find this compound or compounds like it in BindingDB:
Activity Spreadsheet -- Enzyme Inhibition Constant Data from BindingDB
Found 2 hits for monomerid = 50486208
TargetProtoporphyrinogen oxidase(Homo sapiens (Human))
Central China Normal University
Curated by ChEMBL
LigandPNGBDBM50486208(CHEMBL2230219)
Affinity DataKi:  720nM. Assay description: Inhibition of Homo sapiens (human) recombinant protoporphyrinogen oxidase expressed in Escherichia coli JM109 assessed as oxidation of protoporphyrin...
Ligand InfoPC cidPC sid
In DepthDetails ArticlePubMed
TargetProtoporphyrinogen oxidase(Homo sapiens (Human))
Central China Normal University
Curated by ChEMBL
LigandPNGBDBM50486208(CHEMBL2230219)
Affinity DataKi:  724nM. Assay description: Inhibition of Homo sapiens (human) recombinant protoporphyrinogen oxidase expressed in Escherichia coli JM109 assessed as oxidation of protoporphyrin...
Ligand InfoPC cidPC sid
In DepthDetails ArticlePubMed