BDBM50488000 CHEMBL2270660
SMILES OCC1(CO)CS\C(N1)=N/c1ccccc1F
InChI Key InChIKey=PHCLBJBLBOFBBL-UHFFFAOYSA-N
Data  1 IC50
  Tab Delimited (TSV)   2D SDfile   Computed 3D by Vconf -m prep SDfile
Find this compound or compounds like it in BindingDB:
Activity Spreadsheet -- Enzyme Inhibition Constant Data from BindingDB
Found 1 hit for monomerid = 50488000
TargetTrehalase(Sus scrofa)
Dalian University Of Technology
Curated by ChEMBL
LigandPNGBDBM50488000(CHEMBL2270660)
Affinity DataIC50:  8.32E+5nM. Assay description: Inhibition of Sus scrofa (pig) trehalase using trehaloase as substrate incubated for 15 min prior to substrate addition measured after 1.5 hr by spec...
Ligand InfoPC cidPC sid
In DepthDetails ArticlePubMed