BDBM50488382 CHEMBL2286235
SMILES COC(=O)Sc1nc2cc(c(F)cc2s1)-n1nc(C)n(C(F)F)c1=O
InChI Key InChIKey=VSHQJYJNLVGTBL-UHFFFAOYSA-N
Data  1 KI
  Tab Delimited (TSV)   2D SDfile   Computed 3D by Vconf -m prep SDfile
Find this compound or compounds like it in BindingDB:
Activity Spreadsheet -- Enzyme Inhibition Constant Data from BindingDB
Found 1 hit for monomerid = 50488382
TargetProtoporphyrinogen oxidase, chloroplastic(Nicotiana tabacum)
Central China Normal University
Curated by ChEMBL
LigandPNGBDBM50488382(CHEMBL2286235)
Affinity DataKi:  290nM. Assay description: Inhibition of Nicotiana tabacum (tobacco) recombinant PPO assessed as protoporphyrinogen IX formation at room temperature by fluorimetric assay
Ligand InfoPC cidPC sid
In DepthDetails ArticlePubMed