BDBM50488508 CHEMBL2286946
SMILES CC(C)(C)N(NC(=O)c1ccc(I)cc1)C(=O)c1ccccc1Cl
InChI Key InChIKey=XVGIYJFMSOEXKP-UHFFFAOYSA-N
Data  2 EC50
  Tab Delimited (TSV)   2D SDfile   Computed 3D by Vconf -m prep SDfile
Find this compound or compounds like it in BindingDB:
Activity Spreadsheet -- Enzyme Inhibition Constant Data from BindingDB
Found 2 hits for monomerid = 50488508
TargetProtein ultraspiracle(Drosophila melanogaster)
Ghent University
Curated by ChEMBL
LigandPNGBDBM50488508(CHEMBL2286946)
Affinity DataEC50:  7.08E+3nM. Assay description: Agonist activity at ecdysone receptor in Drosophila melanogaster S2 cells after 24 hr by luciferase reporter gene assay
Ligand InfoPC cidPC sid
In DepthDetails ArticlePubMed
TargetEcdysone receptor(Bombyx mori)
Ghent University
Curated by ChEMBL
LigandPNGBDBM50488508(CHEMBL2286946)
Affinity DataEC50:  7.60nM. Assay description: Agonist activity at ecdysone receptor in Bombyx mori Bm5 cells after 24 hr by luciferase reporter gene assay
Ligand InfoPC cidPC sid
In DepthDetails ArticlePubMed