BDBM50491849 CHEMBL2387202
SMILES [H][C@@]12C[C@@H](O)CN1C(=O)[C@@]([H])(NC(=O)[C@H](C[C@@H](O)[C@@H](O)NC(=O)[C@]1([H])[C@@H](O)[C@@H](C)CN1C(=O)[C@@]([H])(NC(=O)[C@@H](NC2=O)[C@H](O)[C@@H](O)c1ccc(O)cc1)[C@@H](C)O)NC(=O)c1ccc(cc1)-c1cc(on1)-c1ccc(OCCCCC)cc1)[C@@H](C)O
InChI Key InChIKey=XJBZLPUMHKZBLW-WFDZVADRSA-N
Data  1 IC50
  Tab Delimited (TSV)   2D SDfile   Computed 3D by Vconf -m prep SDfile
Find this compound or compounds like it in BindingDB:
Activity Spreadsheet -- Enzyme Inhibition Constant Data from BindingDB
Found 1 hit for monomerid = 50491849
Target1,3-beta-D-glucan synthase catalytic subunit(Candida albicans)
Merck Research Laboratories
Curated by ChEMBL
LigandPNGBDBM50491849(CHEMBL2387202)
Affinity DataIC50:  4.40nM. Assay description: Inhibition of wild type Candida albicans 1,3-beta-D-glucan synthase using UDP[6,3H]-glucose as substrate after 60 mins by liquid scintillation counti...
Ligand InfoPC cidPC sid
In DepthDetails ArticlePubMed