BDBM50492303 CHEMBL2398121
SMILES NC1CC=C(C1)C(O)=O
InChI Key InChIKey=CVVDYLXTNDBWJC-UHFFFAOYSA-N
Data  1 IC50
  Tab Delimited (TSV)   2D SDfile   Computed 3D by Vconf -m prep SDfile
Find this compound or compounds like it in BindingDB:
Activity Spreadsheet -- Enzyme Inhibition Constant Data from BindingDB
Found 1 hit for monomerid = 50492303
TargetGamma-aminobutyric acid receptor subunit rho-1(Homo sapiens (Human))
University Of Sydney
Curated by ChEMBL
LigandPNGBDBM50492303(CHEMBL2398121)
Affinity DataIC50:  6.60E+3nM. Assay description: Antagonist activity at human recombinant GABAA rho1 receptor expressed in Xenopus laevis assessed as inhibition of GABA-induced chloride current prod...
In DepthDetails ArticlePubMed