BDBM50492443 CHEMBL2402559
SMILES OC(=O)C(O)=O.Clc1ccc(COC2(CNC2)c2ccccc2)cc1Cl
InChI Key InChIKey=FDAWUMIARKTQIC-UHFFFAOYSA-N
Data  2 KI
  Tab Delimited (TSV)   2D SDfile   Computed 3D by Vconf -m prep SDfile
Find this compound or compounds like it in BindingDB:
Activity Spreadsheet -- Enzyme Inhibition Constant Data from BindingDB
Found 2 hits for monomerid = 50492443
TargetSodium-dependent serotonin transporter(Rattus norvegicus (rat))
University Of New Orleans
Curated by ChEMBL
LigandPNGBDBM50492443(CHEMBL2402559)
Affinity DataKi:  7.30nM. Assay description: Displacement of [3H]Citalopram from SERT in Sprague-Dawley rat brain homogenate after 60 mins by scintillation counting analysis
Ligand InfoPC cidPC sid
In DepthDetails ArticlePubMed
TargetSodium-dependent dopamine transporter(Rattus norvegicus (rat))
University Of New Orleans
Curated by ChEMBL
LigandPNGBDBM50492443(CHEMBL2402559)
Affinity DataKi:  2.82E+3nM. Assay description: Displacement of [3H]WIN 35,428 from DAT in Sprague-Dawley rat brain homogenate preincubated for 5 mins prior to radioligand addition measured after 1...
Ligand InfoPC cidPC sid
In DepthDetails ArticlePubMed