BDBM50492444 CHEMBL2402556
SMILES Cl.CN1CC(C1)(OCc1ccc(Cl)c(Cl)c1)c1ccc(Cl)c(Cl)c1
InChI Key InChIKey=XIZXTKZMZROVKF-UHFFFAOYSA-N
Data  2 KI
  Tab Delimited (TSV)   2D SDfile   Computed 3D by Vconf -m prep SDfile
Find this compound or compounds like it in BindingDB:
Activity Spreadsheet -- Enzyme Inhibition Constant Data from BindingDB
Found 2 hits for monomerid = 50492444
TargetSodium-dependent serotonin transporter(Rattus norvegicus (rat))
University Of New Orleans
Curated by ChEMBL
LigandPNGBDBM50492444(CHEMBL2402556)
Affinity DataKi:  1.30nM. Assay description: Displacement of [3H]Citalopram from SERT in Sprague-Dawley rat brain homogenate after 60 mins by scintillation counting analysis
Ligand InfoPC cidPC sid
In DepthDetails ArticlePubMed
TargetSodium-dependent dopamine transporter(Rattus norvegicus (rat))
University Of New Orleans
Curated by ChEMBL
LigandPNGBDBM50492444(CHEMBL2402556)
Affinity DataKi:  436nM. Assay description: Displacement of [3H]WIN 35,428 from DAT in Sprague-Dawley rat brain homogenate preincubated for 5 mins prior to radioligand addition measured after 1...
Ligand InfoPC cidPC sid
In DepthDetails ArticlePubMed