BDBM50492772 CHEMBL2413828
SMILES C(CCN1CCCCC1)COc1ccc(cc1)-c1ccc(OCCCN2CCCCC2)cc1
InChI Key InChIKey=KJOKCCIMCKAQSF-UHFFFAOYSA-N
Data  1 KI
  Tab Delimited (TSV)   2D SDfile   Computed 3D by Vconf -m prep SDfile
Find this compound or compounds like it in BindingDB:
Activity Spreadsheet -- Enzyme Inhibition Constant Data from BindingDB
Found 1 hit for monomerid = 50492772
TargetHistamine H3 receptor(Homo sapiens (Human))
Bioprojet-Biotech
Curated by ChEMBL
LigandPNGBDBM50492772(CHEMBL2413828)
Affinity DataKi:  0.130nM. Assay description: Displacement of [125I]iodoproxyfan from histamine H3 receptor (unknown origin) expressed in CHO cells
Ligand InfoPC cidPC sid
In DepthDetails ArticlePubMed