BDBM50493307 CHEMBL2426456
SMILES [H][C@]12CC(C)(C)C[C@@H](OC(=O)N[C@@H](Cc3ccccc3)[C@H](O)CN(CC(C)C)S(=O)(=O)c3ccc(OC)cc3)[C@@]1([H])[C@]1([H])CCO[C@]1([H])O2
InChI Key InChIKey=DSIZTJKHNCNJNW-KTKZCLBLSA-N
Data  1 KI
  Tab Delimited (TSV)   2D SDfile   Computed 3D by Vconf -m prep SDfile
Find this compound or compounds like it in BindingDB:
Activity Spreadsheet -- Enzyme Inhibition Constant Data from BindingDB
Found 1 hit for monomerid = 50493307
TargetProtease(Human immunodeficiency virus 1 (HIV-1))
Purdue University
Curated by ChEMBL
LigandPNGBDBM50493307(CHEMBL2426456)
Affinity DataKi:  139nM. Assay description: Inhibition of HIV1 LAI protease by fluorescence assay
Ligand InfoPC cidPC sid
In DepthDetails ArticlePubMed