BDBM50495643 CHEMBL3114175
SMILES CCCCn1cccc(C(=O)NC2CCC(C)CC2)c1=O
InChI Key InChIKey=BTRLEVJMKJXOEY-UHFFFAOYSA-N
Data  2 KI
  Tab Delimited (TSV)   2D SDfile   Computed 3D by Vconf -m prep SDfile
Find this compound or compounds like it in BindingDB:
Activity Spreadsheet -- Enzyme Inhibition Constant Data from BindingDB
Found 2 hits for monomerid = 50495643
TargetCannabinoid receptor 2(Homo sapiens (Human))
Universit£
Curated by ChEMBL
LigandPNGBDBM50495643(CHEMBL3114175)
Affinity DataKi:  104nM. Assay description: Displacement of [3H]CP55,940 from human recombinant CB2 receptor expressed in HEK293 cell membranes after 90 mins
Ligand InfoPC cidPC sid
In DepthDetails ArticlePubMed
TargetCannabinoid receptor 1(Homo sapiens (Human))
Universit£
Curated by ChEMBL
LigandPNGBDBM50495643(CHEMBL3114175)
Affinity DataKi:  1.62E+3nM. Assay description: Displacement of [3H]CP55,940 from human recombinant CB1 receptor expressed in HEK293 cell membranes after 90 mins
Ligand InfoPC cidPC sid
In DepthDetails ArticlePubMed