BDBM50495648 CHEMBL3114179
SMILES Brc1cc(C(=O)NC2CCCCCC2)c(=O)n(CCN2CCOCC2)c1
InChI Key InChIKey=BGIRTFQKCXMFOC-UHFFFAOYSA-N
Data  2 KI
  Tab Delimited (TSV)   2D SDfile   Computed 3D by Vconf -m prep SDfile
Find this compound or compounds like it in BindingDB:
Activity Spreadsheet -- Enzyme Inhibition Constant Data from BindingDB
Found 2 hits for monomerid = 50495648
TargetCannabinoid receptor 2(Homo sapiens (Human))
Universit£
Curated by ChEMBL
LigandPNGBDBM50495648(CHEMBL3114179)
Affinity DataKi:  65nM. Assay description: Displacement of [3H]CP55,940 from human recombinant CB2 receptor expressed in HEK293 cell membranes after 90 mins
Ligand InfoPC cidPC sid
In DepthDetails ArticlePubMed
TargetCannabinoid receptor 1(Homo sapiens (Human))
Universit£
Curated by ChEMBL
LigandPNGBDBM50495648(CHEMBL3114179)
Affinity DataKi:  243nM. Assay description: Displacement of [3H]CP55,940 from human recombinant CB1 receptor expressed in HEK293 cell membranes after 90 mins
Ligand InfoPC cidPC sid
In DepthDetails ArticlePubMed