BDBM50496808 CHEMBL3218045
SMILES COc1cccc2ccc(CSc3ccc(cc3)-c3nn(C)cc3-c3ccncc3)nc12
InChI Key InChIKey=ISWQPFIAGSGDGW-UHFFFAOYSA-N
Data  1 IC50
  Tab Delimited (TSV)   2D SDfile   Computed 3D by Vconf -m prep SDfile
Find this compound or compounds like it in BindingDB:
Activity Spreadsheet -- Enzyme Inhibition Constant Data from BindingDB
Found 1 hit for monomerid = 50496808
TargetcAMP and cAMP-inhibited cGMP 3',5'-cyclic phosphodiesterase 10A(Homo sapiens (Human))
Washington University School Of Medicine
Curated by ChEMBL
LigandPNGBDBM50496808(CHEMBL3218045)
Affinity DataIC50:  635nM. Assay description: Inhibition of human recombinant PDE10A catalytic domain assessed reduction in [3H]cAMP hydrolysis preincubated with enzyme for 5 mins prior to substr...
Ligand InfoPC cidPC sid
In DepthDetails ArticlePubMed