BDBM50496819 CHEMBL3222272
SMILES COc1cccc2ccc(CNc3ccc(cc3)-c3nn(C)cc3-c3ccncc3)nc12
InChI Key InChIKey=XWHXEEWWOZZYCU-UHFFFAOYSA-N
Data  1 IC50
  Tab Delimited (TSV)   2D SDfile   Computed 3D by Vconf -m prep SDfile
Find this compound or compounds like it in BindingDB:
Activity Spreadsheet -- Enzyme Inhibition Constant Data from BindingDB
Found 1 hit for monomerid = 50496819
TargetcAMP and cAMP-inhibited cGMP 3',5'-cyclic phosphodiesterase 10A(Homo sapiens (Human))
Washington University School Of Medicine
Curated by ChEMBL
LigandPNGBDBM50496819(CHEMBL3222272)
Affinity DataIC50:  1.09E+4nM. Assay description: Inhibition of human recombinant PDE10A catalytic domain assessed reduction in [3H]cAMP hydrolysis preincubated with enzyme for 5 mins prior to substr...
Ligand InfoPC cidPC sid
In DepthDetails ArticlePubMed