BDBM50496881 CHEMBL3228683
SMILES Cl.[H][C@@]12CCC[C@@]3([H])[C@@]4([H])Cc5cccc(O1)c5[C@@]23CCN4
InChI Key InChIKey=FXUGBUWQEAQGNM-ROSXVIFBSA-N
Data  1 EC50
  Tab Delimited (TSV)   2D SDfile   Computed 3D by Vconf -m prep SDfile
Find this compound or compounds like it in BindingDB:
Activity Spreadsheet -- Enzyme Inhibition Constant Data from BindingDB
Found 1 hit for monomerid = 50496881
TargetDelta-type/Kappa-type/Mu-type opioid receptor(Rattus norvegicus (rat))
TBA
Curated by ChEMBL
LigandPNGBDBM50496881(CHEMBL3228683)
Affinity DataEC50:  10nM. Assay description: Binding affinity to opioid receptor in rat brain homogenates
Ligand InfoPC cidPC sid
In DepthDetails ArticlePubMed