BDBM50497315 CHEMBL3188490
SMILES CC(C)c1ccccc1-c1nc(NCc2ccc(cc2)-c2cccnc2)c2sccc2n1
InChI Key InChIKey=NNCIGEGVIIXSMD-UHFFFAOYSA-N
Data  1 IC50
  Tab Delimited (TSV)   2D SDfile   Computed 3D by Vconf -m prep SDfile
Find this compound or compounds like it in BindingDB:
Activity Spreadsheet -- Enzyme Inhibition Constant Data from BindingDB
Found 1 hit for monomerid = 50497315
TargetWD repeat-containing protein 48(Homo sapiens (Human))
National Center For Advancing Translational Sciences
Curated by ChEMBL
LigandPNGBDBM50497315(CHEMBL3188490)
Affinity DataIC50:  110nM. Assay description: Inhibition of human USP1/UAF1 using Ub-AMC substrate by fluorescence assay
Ligand InfoPC cidPC sid
In DepthDetails ArticlePubMed