BDBM50497343 CHEMBL3189092
SMILES Cc1cnc(nc1NCc1ccc(cc1)-n1ccnn1)-c1ccccc1C(F)F
InChI Key InChIKey=FTVAQPNJOHGXJS-UHFFFAOYSA-N
Data  1 IC50
  Tab Delimited (TSV)   2D SDfile   Computed 3D by Vconf -m prep SDfile
Find this compound or compounds like it in BindingDB:
Activity Spreadsheet -- Enzyme Inhibition Constant Data from BindingDB
Found 1 hit for monomerid = 50497343
TargetWD repeat-containing protein 48(Homo sapiens (Human))
National Center For Advancing Translational Sciences
Curated by ChEMBL
LigandPNGBDBM50497343(CHEMBL3189092)
Affinity DataIC50:  820nM. Assay description: Inhibition of human USP1/UAF1 using Ub-AMC substrate by fluorescence assay
Ligand InfoPC cidPC sid
In DepthDetails ArticlePubMed