BDBM50497922 CHEMBL3323382
SMILES CCCCCCCNC(=O)Oc1ccc2nc3N(CCCN4CCCCC4)CCCn3c(=O)c2c1
InChI Key InChIKey=VTZMXRQFIWAQNE-UHFFFAOYSA-N
Data  4 IC50
  Tab Delimited (TSV)   2D SDfile   Computed 3D by Vconf -m prep SDfile
Find this compound or compounds like it in BindingDB:
Activity Spreadsheet -- Enzyme Inhibition Constant Data from BindingDB
Found 4 hits for monomerid = 50497922
TargetAcetylcholinesterase(Electrophorus electricus (Electric eel))
Universit£T Regensburg
Curated by ChEMBL
LigandPNGBDBM50497922(CHEMBL3323382)
Affinity DataIC50:  7.94E+3nM. Assay description: Inhibition of electric eel AChE using ATC iodide substrate by DTNB based assay
Ligand InfoPC cidPC sid
In DepthDetails ArticlePubMed
TargetCholinesterase(Equus caballus (Horse))
Universit£T Regensburg
Curated by ChEMBL
LigandPNGBDBM50497922(CHEMBL3323382)
Affinity DataIC50:  25nM. Assay description: Inhibition of equine serum BChE using ATC iodide substrate by DTNB based assay
Ligand InfoPC cidPC sid
In DepthDetails ArticlePubMed
TargetAcetylcholinesterase(Electrophorus electricus (Electric eel))
Universit£T Regensburg
Curated by ChEMBL
LigandPNGBDBM50497922(CHEMBL3323382)
Affinity DataIC50:  7.95E+3nM. Assay description: Inhibition of electric eel AChE using ATC iodide substrate by DTNB based assay
Ligand InfoPC cidPC sid
In DepthDetails ArticlePubMed
TargetCholinesterase(Equus caballus (Horse))
Universit£T Regensburg
Curated by ChEMBL
LigandPNGBDBM50497922(CHEMBL3323382)
Affinity DataIC50:  25nM. Assay description: Inhibition of equine serum BChE using ATC iodide substrate by DTNB based assay
Ligand InfoPC cidPC sid
In DepthDetails ArticlePubMed