BDBM50499648 CHEMBL3741572
SMILES OC(=O)C1CN(Cc2ccc(OCc3cccc(c3)C(F)(F)F)c(F)c2)C1
InChI Key InChIKey=ZRXGROOHYIFHII-UHFFFAOYSA-N
Data  2 IC50
  Tab Delimited (TSV)   2D SDfile   Computed 3D by Vconf -m prep SDfile
Find this compound or compounds like it in BindingDB:
Activity Spreadsheet -- Enzyme Inhibition Constant Data from BindingDB
Found 2 hits for monomerid = 50499648
TargetSphingosine 1-phosphate receptor 5(Homo sapiens (Human))
Abbvie Bioresearch Center
Curated by ChEMBL
LigandPNGBDBM50499648(CHEMBL3741572)
Affinity DataIC50:  2nM. Assay description: Displacement of [33P]S1P from S1P5 receptor (unknown origin) expressed in HEK cell membranes after 45 to 60 mins by scintillation counting based RLB ...
Ligand InfoPC cidPC sid
In DepthDetails ArticlePubMed
TargetSphingosine 1-phosphate receptor 1(Homo sapiens (Human))
Abbvie Bioresearch Center
Curated by ChEMBL
LigandPNGBDBM50499648(CHEMBL3741572)
Affinity DataIC50:  401nM. Assay description: Agonist activity at S1P1 receptor (unknown origin) expressed in CHO cell membranes after 30 mins by GTPgammaS binding based MFB method
Ligand InfoPC cidPC sid
In DepthDetails ArticlePubMed