BDBM50499683 CHEMBL3740009
SMILES CCCCCC(=O)c1ccc(CN2CC(C2)C(O)=O)cc1
InChI Key InChIKey=WTAPDEUYIWFOCF-UHFFFAOYSA-N
Data  1 IC50
  Tab Delimited (TSV)   2D SDfile   Computed 3D by Vconf -m prep SDfile
Find this compound or compounds like it in BindingDB:
Activity Spreadsheet -- Enzyme Inhibition Constant Data from BindingDB
Found 1 hit for monomerid = 50499683
TargetSphingosine 1-phosphate receptor 5(Homo sapiens (Human))
Abbvie Bioresearch Center
Curated by ChEMBL
LigandPNGBDBM50499683(CHEMBL3740009)
Affinity DataIC50:  2nM. Assay description: Agonist activity at S1P5 receptor (unknown origin) expressed in CHO cell membranes after 30 mins by GTPgammaS binding based MFB method
Ligand InfoPC cidPC sid
In DepthDetails ArticlePubMed