BDBM50499794 CHEMBL3741163
SMILES [H][C@]12CC[C@@]3([H])C4(C)COC[C@@]3(C[C@H]([C@@H]4OC[C@](C)(N)C(C)C)n3nnc(C)n3)C1=CC[C@@]1(C)[C@H](C(O)=O)[C@](C)(CC[C@]21C)[C@H](C)C(C)C
InChI Key InChIKey=BZMJJHZIRLHHJF-ADSZJUJISA-N
Data  1 IC50
  Tab Delimited (TSV)   2D SDfile   Computed 3D by Vconf -m prep SDfile
Find this compound or compounds like it in BindingDB:
Activity Spreadsheet -- Enzyme Inhibition Constant Data from BindingDB
Found 1 hit for monomerid = 50499794
Target1,3-beta-D-glucan synthase catalytic subunit(Candida albicans)
Merck Research Laboratories
Curated by ChEMBL
LigandPNGBDBM50499794(CHEMBL3741163)
Affinity DataIC50:  24.5nM. Assay description: Displacement of UDP-[3H]glucose from beta-1,3-glucan synthase in Candida albicans MY1055 microsomal membranes incubated for 2 hrs
Ligand InfoPC cidPC sid
In DepthDetails ArticlePubMed