BDBM50500233 CHEMBL3747043
SMILES COc1ccc(cc1)-c1nc(NC(=O)NCCCC(=O)NO)cc2c3ccccc3[nH]c12
InChI Key InChIKey=XJGWDJIBLGZJOF-UHFFFAOYSA-N
Data  4 IC50
  Tab Delimited (TSV)   2D SDfile   Computed 3D by Vconf -m prep SDfile
Find this compound or compounds like it in BindingDB:
Activity Spreadsheet -- Enzyme Inhibition Constant Data from BindingDB
Found 4 hits for monomerid = 50500233
TargetHistone deacetylase 1(Homo sapiens (Human))
China Pharmaceutical University
Curated by ChEMBL
LigandPNGBDBM50500233(CHEMBL3747043)
Affinity DataIC50:  26nM. Assay description: Inhibition of HDAC1 in human HeLa cell nuclear extract using Boc-Lys (Ac)-AMC as substrate after 60 mins by fluorometric analysis
Ligand InfoPC cidPC sid
In DepthDetails ArticlePubMed
TargetHistone deacetylase(Homo sapiens (Human))
China Pharmaceutical University
Curated by ChEMBL
LigandPNGBDBM50500233(CHEMBL3747043)
Affinity DataIC50:  270nM. Assay description: Inhibition of HDAC in human HeLa cell nuclear extract using Boc-Lys (Ac)-AMC as substrate after 60 mins by fluorometric analysis
Ligand InfoPC cidPC sid
In DepthDetails ArticlePubMed
TargetHistone deacetylase 8(Homo sapiens (Human))
China Pharmaceutical University
Curated by ChEMBL
LigandPNGBDBM50500233(CHEMBL3747043)
Affinity DataIC50:  160nM. Assay description: Inhibition of HDAC8 in human HeLa cell nuclear extract using Boc-Lys (Ac)-AMC as substrate after 60 mins by fluorometric analysis
Ligand InfoPC cidPC sid
In DepthDetails ArticlePubMed
TargetHistone deacetylase 6(Homo sapiens (Human))
China Pharmaceutical University
Curated by ChEMBL
LigandPNGBDBM50500233(CHEMBL3747043)
Affinity DataIC50:  34nM. Assay description: Inhibition of HDAC6 in human HeLa cell nuclear extract using Boc-Lys (Ac)-AMC as substrate after 60 mins by fluorometric analysis
Ligand InfoPC cidPC sid
In DepthDetails ArticlePubMed